BDBM50168114 CHEMBL3799249
SMILES Nc1nc(nc2cn(nc12)-c1ccccc1O)-c1ccco1
InChI Key InChIKey=KBVHSEZTMVRCNH-UHFFFAOYSA-N
Data  2 KI
  Tab Delimited (TSV)   2D SDfile   Computed 3D by Vconf -m prep SDfile
Find this compound or compounds like it in BindingDB:
Activity Spreadsheet -- Enzyme Inhibition Constant Data from BindingDB
Found 1 hit for monomerid = 50168114
TargetAdenosine receptor A1(Homo sapiens (Human))
Universit£
Curated by ChEMBL
LigandPNGBDBM50168114(CHEMBL3799249)
Affinity DataKi:  372nM. Assay description: Displacement of [3H]-DPCPX from human adenosine A1 receptor expressed in CHO cell membranes after 120 mins by scintillation counting method
In DepthDetails ArticlePubMed